Target
Protein-arginine deiminase type-4
Ligand
BDBM50373918
Substrate
Meas. Tech.
ChEMBL_468732 (CHEMBL929914)
IC50
>10000000±n/a nM
Citation
 Knuckley, BLuo, YThompson, PR Profiling Protein Arginine Deiminase 4 (PAD4): a novel screen to identify PAD4 inhibitors. Bioorg Med Chem 16:739-45 (2008)  
Target
Name:
Protein-arginine deiminase type-4
Synonyms:
PAD4 PADI4_HUMAN PDI5
Type:
Enzyme Catalytic Domain
Mol. Mass.:
74078.90
Organism:
Homo sapiens (Human)
Description:
gi_216548487
Residue:
663
  
Inhibitor
Name:
BDBM50373918
Synonyms:
AZITHROMYCIN | Azasite
Type:
Small organic molecule
Emp. Form.:
C38H72N2O12
Mol. Mass.:
748.9845
SMILES:
CC[C@H]1OC(=O)[C@H](C)[C@@H](O[C@H]2C[C@@](C)(OC)[C@@H](O)[C@H](C)O2)[C@H](C)[C@@H](O[C@@H]2O[C@H](C)C[C@@H]([C@H]2O)N(C)C)[C@](C)(O)C[C@@H](C)CN(C)[C@H](C)[C@@H](O)[C@]1(C)O
: