Target
Muscarinic acetylcholine receptor M3
Ligand
BDBM50165008
Substrate
Meas. Tech.
ChEMBL_468831 (CHEMBL932204)
Ki
3.6±n/a nM
Citation
 Jones, LHRandall, ANapier, CTrevethick, MSreckovic, SWatson, J Design and synthesis of a fluorescent muscarinic antagonist. Bioorg Med Chem Lett 18:825-7 (2008)  
Target
Name:
Muscarinic acetylcholine receptor M3
Synonyms:
ACM3_HUMAN Cholinergic, muscarinic M3 Muscarinic receptor M3 | RecName: Full=Muscarinic acetylcholine receptor M3
Type:
Enzyme
Mol. Mass.:
66151.03
Organism:
Homo sapiens (Human)
Description:
P20309
Residue:
590
  
Inhibitor
Name:
BDBM50165008
Synonyms:
(+)-(R)-2-(alpha-(2-(Diisopropylamino)ethyl)benzyl)-p-cresol 2-[(1R)-3-(diisopropylamino)-1-phenylpropyl]-4-methylphenol TOLTERODINE
Type:
Small organic molecule
Emp. Form.:
C22H31NO
Mol. Mass.:
325.4876
SMILES:
CC(C)N(CC[C@H](c1ccccc1)c1cc(C)ccc1O)C(C)C
: