Target
Cyclin-dependent kinase 1
Ligand
BDBM7744
Substrate
Meas. Tech.
ChEMBL_468974 (CHEMBL952119)
IC50
29±n/a nM
Citation
 Kolb, PHuang, DDey, FCaflisch, A Discovery of kinase inhibitors by high-throughput docking and scoring based on a transferable linear interaction energy model. J Med Chem 51:1179-88 (2008)  
Target
Name:
Cyclin-dependent kinase 1
Synonyms:
CDC2 CDK1 CDKN1 Cell division protein kinase 1 P34CDC2 | p34 protein kinase
Type:
Enzyme Subunit
Mol. Mass.:
34101.08
Organism:
Homo sapiens (Human)
Description:
P06493
Residue:
297
  
Inhibitor
Name:
BDBM7744
Synonyms:
4-({[(12Z)-11-oxo-3-thia-5,10-diazatricyclo[7.3.0.0^{2,6}]dodeca-1,4,6,8-tetraen-12-ylidene]methyl}amino)benzene-1-sulfonamide Oxindole-Based Inhibitor 80
Type:
Small organic molecule
Emp. Form.:
C16H12N4O3S2
Mol. Mass.:
372.421
SMILES:
NS(=O)(=O)c1ccc(cc1)N=CC1C(=O)Nc2ccc3ncsc3c12
: