Target
Cyclin-dependent kinase 2
Ligand
BDBM7693
Substrate
Meas. Tech.
ChEMBL_468964 (CHEMBL952109)
IC50
1.5±n/a nM
Citation
 Kolb, PHuang, DDey, FCaflisch, A Discovery of kinase inhibitors by high-throughput docking and scoring based on a transferable linear interaction energy model. J Med Chem 51:1179-88 (2008)  
Target
Name:
Cyclin-dependent kinase 2
Synonyms:
CDK2 CDK2_HUMAN Cell division protein kinase 2 Protein cereblon/Cyclin-dependent kinase 2 | p33 protein kinase
Type:
Enzyme Subunit
Mol. Mass.:
33938.17
Organism:
Homo sapiens (Human)
Description:
P24941
Residue:
298
  
Inhibitor
Name:
BDBM7693
Synonyms:
4-{2-[(3Z)-4-(2-methylprop-1-en-1-yl)-2-oxo-2,3-dihydro-1H-indol-3-ylidene]hydrazin-1-yl}benzene-1-sulfonamide Oxindole-Based Inhibitor 29
Type:
Small organic molecule
Emp. Form.:
C18H18N4O3S
Mol. Mass.:
370.426
SMILES:
[#6]\[#6](-[#6])=[#6]\c1cccc2-[#7]-[#6](=O)-[#6](=[#7]-[#7]-c3ccc(cc3)S([#7])(=O)=O)-c12
: