Target
Protein kinase C gamma type
Ligand
BDBM50057511
Substrate
Meas. Tech.
ChEMBL_469038 (CHEMBL930947)
Ki
210±n/a nM
Citation
 Sugimoto, TItagaki, KIrie, K Design and physicochemical properties of new fluorescent ligands of protein kinase C isozymes focused on CH/pi interaction. Bioorg Med Chem 16:650-7 (2008)  
Target
Name:
Protein kinase C gamma type
Synonyms:
KPCG_HUMAN PKC-gamma PRKCG Protein kinase C gamma type Protein kinase C, gamma
Type:
Enzyme
Mol. Mass.:
78458.05
Organism:
Homo sapiens (Human)
Description:
The recombinant human PKC enzymes were produced using a baculovirus expression system in SF9 cells
Residue:
697
  
Inhibitor
Name:
BDBM50057511
Synonyms:
(+/-)-indolactum-V 13-Hydroxymethyl-10-isopropyl-9-methyl-3,9,12-triaza-tricyclo[6.6.1.0*4,15*]pentadeca-1,4,6,8(15)-tetraen-11-one (10S,13S)-13-Hydroxymethyl-10-isopropyl-9-methyl-3,9,12-triaza-tricyclo[6.6.1.0*4,15*]pentadeca-1,4(15),5,7-tetraen-11-one (2S,5S)-5-(hydroxymethyl)-2-isopropyl-1-methyl-1,2,5,6-tetrahydro-4H-[1,4]diazonino[7,6,5-cd]indol-3(8H)-one 13-Hydroxymethyl-10-isopropyl-9-methyl-3,9,12-triaza-tricyclo[6.6.1.0*4,15*]pentadeca-1,4(15),5,7-tetraen-11-one CHEMBL27266 indolactam-V
Type:
Small organic molecule
Emp. Form.:
C17H23N3O2
Mol. Mass.:
301.3834
SMILES:
CC(C)[C@@H]1N(C)c2cccc3[nH]cc(C[C@@H](CO)NC1=O)c23
: