Target
Carbonic anhydrase 12
Ligand
BDBM10880
Substrate
Meas. Tech.
ChEMBL_469185 (CHEMBL932210)
Ki
5.7±n/a nM
Citation
 Rami, MWinum, JYInnocenti, AMontero, JLScozzafava, ASupuran, CT Carbonic anhydrase inhibitors: copper(II) complexes of polyamino-polycarboxylamido aromatic/heterocyclic sulfonamides are very potent inhibitors of the tumor-associated isoforms IX and XII. Bioorg Med Chem Lett 18:836-41 (2008)  
Target
Name:
Carbonic anhydrase 12
Synonyms:
CA-XII CAH12_HUMAN Carbonic anhydrase Carbonic anhydrase XII Carbonic anhydrase XII (CAXII) | Tumor antigen HOM-RCC-3.1.3
Type:
Enzyme
Mol. Mass.:
39456.00
Organism:
Homo sapiens (Human)
Description:
Catalytic domain of human cloned isozyme was used in the assay
Residue:
354
  
Inhibitor
Name:
BDBM10880
Synonyms:
AZA AZM acetazolamide Acetazolamide Acetazolamide (AZA) Acetazolamide, 5 Acetazolamide, AZA CHEMBL20 Sulfonamide, 1 US11278534, Example acetazolamide sulfonamide 1
Type:
Small organic molecule
Emp. Form.:
C4H6N4O3S2
Mol. Mass.:
222.245
SMILES:
CC(=O)Nc1nnc(s1)S(N)(=O)=O
: