Target
Prolyl endopeptidase
Ligand
BDBM50135633
Substrate
Meas. Tech.
ChEMBL_469259 (CHEMBL949941)
Ki
4±n/a nM
Citation
 Maryanoff, BECostanzo, MJ Inhibitors of proteases and amide hydrolases that employ an alpha-ketoheterocycle as a key enabling functionality. Bioorg Med Chem 16:1562-95 (2008)  
Target
Name:
Prolyl endopeptidase
Synonyms:
PE POP PREP Prolyl oligopeptidase
Type:
Enzyme
Mol. Mass.:
80688.50
Organism:
Homo sapiens (Human)
Description:
P48147
Residue:
710
  
Inhibitor
Name:
BDBM50135633
Synonyms:
(S)-2-[(S)-2-(5-Benzyloxymethyl-isoxazole-3-carbonyl)-pyrrolidine-1-carbonyl]-pyrrolidine-1-carboxylic acid benzyl ester CHEMBL318284
Type:
Small organic molecule
Emp. Form.:
C29H31N3O6
Mol. Mass.:
517.5729
SMILES:
O=C(OCc1ccccc1)N1CCC[C@H]1C(=O)N1CCC[C@H]1C(=O)c1cc(COCc2ccccc2)on1
: