Target
Sodium-dependent serotonin transporter
Ligand
BDBM50032371
Substrate
Meas. Tech.
ChEMBL_469335 (CHEMBL932889)
IC50
5400±n/a nM
Citation
 Chen, CDyck, BFleck, BAFoster, ACGrey, JJovic, FMesleh, MPhan, KTamiya, JVickers, TZhang, M Studies on the SAR and pharmacophore of milnacipran derivatives as monoamine transporter inhibitors. Bioorg Med Chem Lett 18:1346-9 (2008)  
Target
Name:
Sodium-dependent serotonin transporter
Synonyms:
5-HT Transporter 5HTT SC6A4_HUMAN SLC6A4 Serotonin transporter (5HTT) Sodium-dependent serotonin transporter (SERT) | Solute carrier family 6 member 4
Type:
Multi-pass membrane protein
Mol. Mass.:
70322.51
Organism:
Homo sapiens (Human)
Description:
P31645
Residue:
630
  
Inhibitor
Name:
BDBM50032371
Synonyms:
(1S,2R)-2-Methylaminomethyl-1-phenyl-cyclopropanecarboxylic acid diethylamide | CHEMBL98994
Type:
Small organic molecule
Emp. Form.:
C16H24N2O
Mol. Mass.:
260.3746
SMILES:
CCN(CC)C(=O)[C@]1(C[C@H]1CNC)c1ccccc1
: