Target
Synaptic vesicular amine transporter
Ligand
BDBM50374534
Substrate
Meas. Tech.
ChEMBL_469572 (CHEMBL932301)
Ki
4500±n/a nM
Citation
 Wimalasena, DSPerera, RPHeyen, BJBalasooriya, ISWimalasena, K Vesicular monoamine transporter substrate/inhibitor activity of MPTP/MPP+ derivatives: a structure-activity study. J Med Chem 51:760-8 (2008)  
Target
Name:
Synaptic vesicular amine transporter
Synonyms:
Monoamine transporter Solute carrier family 18 member 2 VMAT2 Vesicular amine transporter 2
Type:
PROTEIN
Mol. Mass.:
55749.95
Organism:
Bos taurus
Description:
ChEMBL_469572
Residue:
517
  
Inhibitor
Name:
BDBM50374534
Synonyms:
CHEMBL270469
Type:
Small organic molecule
Emp. Form.:
C26H22N
Mol. Mass.:
348.459
SMILES:
C=C(C[n+]1ccc(cc1)-c1ccccc1)c1ccc(cc1)-c1ccccc1
: