Target
Synaptic vesicular amine transporter
Ligand
BDBM50374545
Substrate
Meas. Tech.
ChEMBL_469572 (CHEMBL932301)
Ki
38400±n/a nM
Citation
 Wimalasena, DSPerera, RPHeyen, BJBalasooriya, ISWimalasena, K Vesicular monoamine transporter substrate/inhibitor activity of MPTP/MPP+ derivatives: a structure-activity study. J Med Chem 51:760-8 (2008)  
Target
Name:
Synaptic vesicular amine transporter
Synonyms:
Monoamine transporter Solute carrier family 18 member 2 VMAT2 Vesicular amine transporter 2
Type:
PROTEIN
Mol. Mass.:
55749.95
Organism:
Bos taurus
Description:
ChEMBL_469572
Residue:
517
  
Inhibitor
Name:
BDBM50374545
Synonyms:
CHEMBL536788
Type:
Small organic molecule
Emp. Form.:
C13H17N
Mol. Mass.:
187.2808
SMILES:
CN1CCC(=CC1)c1ccccc1C
: