Target
Gamma-aminobutyric acid receptor subunit rho-1
Ligand
BDBM50021187
Substrate
Meas. Tech.
ChEMBL_469764 (CHEMBL945996)
EC50
19100±n/a nM
Citation
 Hinton, TChebib, MJohnston, GA Enantioselective actions of 4-amino-3-hydroxybutanoic acid and (3-amino-2-hydroxypropyl)methylphosphinic acid at recombinant GABA(C) receptors. Bioorg Med Chem Lett 18:402-4 (2008)  
Target
Name:
Gamma-aminobutyric acid receptor subunit rho-1
Synonyms:
GABA receptor rho-1 subunit GABRR1 | GBRR1_HUMAN
Type:
PROTEIN
Mol. Mass.:
55892.34
Organism:
Homo sapiens (Human)
Description:
ChEMBL_1456653
Residue:
479
  
Inhibitor
Name:
BDBM50021187
Synonyms:
4-Amino-3-hydroxy-butyric acid R(-)-4-amino-3-hydroxybutanoic acid
Type:
Small organic molecule
Emp. Form.:
C4H9NO3
Mol. Mass.:
119.1192
SMILES:
NC[C@H](O)CC(O)=O
: