Target
Solanesyl diphosphate synthase
Ligand
BDBM50341916
Substrate
Meas. Tech.
ChEMBL_469918 (CHEMBL939265)
IC50
252±n/a nM
Citation
 Szajnman, SHGarcía Liñares, GELi, ZHJiang, CGalizzi, MBontempi, EJFerella, MMoreno, SNDocampo, RRodriguez, JB Synthesis and biological evaluation of 2-alkylaminoethyl-1,1-bisphosphonic acids against Trypanosoma cruzi and Toxoplasma gondii targeting farnesyl diphosphate synthase. Bioorg Med Chem 16:3283-90 (2008)  
Target
Name:
Solanesyl diphosphate synthase
Synonyms:
Farnesyl synthetase, putative | Solanesyl diphosphate synthase
Type:
PROTEIN
Mol. Mass.:
39372.51
Organism:
Trypanosoma cruzi
Description:
ChEMBL_469918
Residue:
363
  
Inhibitor
Name:
BDBM50341916
Synonyms:
1-[(n-oct-1-ylamino)ethyl]-1,1-bisphosphonic acid CHEMBL260601
Type:
Small organic molecule
Emp. Form.:
C10H25NO6P2
Mol. Mass.:
317.2561
SMILES:
CCCCCCCCNCC(P(O)(O)=O)P(O)(O)=O
: