Target
Coagulation factor X
Ligand
BDBM50374871
Substrate
Meas. Tech.
ChEMBL_470061 (CHEMBL933439)
Ki
0.043±n/a nM
Citation
 Smallheer, JMWang, SLaws, MLNakajima, SHu, ZHan, WJacobson, ILuettgen, JMRossi, KARendina, ARKnabb, RMWexler, RRLam, PYQuan, ML Sulfonamidolactam inhibitors of coagulation factor Xa. Bioorg Med Chem Lett 18:2428-33 (2008)  
Target
Name:
Coagulation factor X
Synonyms:
Activated coagulation factor X (FXa) Coagulation factor X precursor F10 Factor X heavy chain Factor Xa Stuart-Prower factor
Type:
Enzyme
Mol. Mass.:
54726.60
Organism:
Homo sapiens (Human)
Description:
Residue:
488
  
Inhibitor
Name:
BDBM50374871
Synonyms:
CHEMBL258274
Type:
Small organic molecule
Emp. Form.:
C26H23ClN4O6S2
Mol. Mass.:
587.067
SMILES:
COC(=O)CN(C1CCCN(C1=O)c1ccc(cc1)-n1ccccc1=O)S(=O)(=O)c1cc2ccc(Cl)nc2s1
: