Target
Calcium/calmodulin-dependent protein kinase type II subunit delta
Ligand
BDBM50374965
Substrate
Meas. Tech.
ChEMBL_470095 (CHEMBL933473)
IC50
66±n/a nM
Citation
 Mavunkel, BXu, YJGoyal, BLim, DLu, QChen, ZWang, DXHigaki, JChakraborty, ILiclican, ASideris, SLaney, MDelling, UCatalano, RHiggins, LSWang, HWang, JFeng, YDugar, SLevy, DE Pyrimidine-based inhibitors of CaMKIIdelta. Bioorg Med Chem Lett 18:2404-8 (2008)  
Target
Name:
Calcium/calmodulin-dependent protein kinase type II subunit delta
Synonyms:
CAMK2D CaM kinase II CaMK-II subunit delta Calcium/calmodulin-dependent protein kinase type II subunit delta (CAMK2D) KCC2D_HUMAN
Type:
Enzyme Catalytic Domain
Mol. Mass.:
56419.78
Organism:
Homo sapiens (Human)
Description:
Q13557
Residue:
499
  
Inhibitor
Name:
BDBM50374965
Synonyms:
CHEMBL255617
Type:
Small organic molecule
Emp. Form.:
C16H13N5O2
Mol. Mass.:
307.3067
SMILES:
Nc1cc(Nc2nccc(n2)-c2ccc(cc2)C(O)=O)ccn1
: