Target
Dipeptidyl peptidase 4
Ligand
BDBM50205206
Substrate
Meas. Tech.
ChEMBL_470201 (CHEMBL939125)
IC50
10±n/a nM
Citation
 Kondo, TNekado, TSugimoto, IOchi, KTakai, SKinoshita, AHatayama, AYamamoto, SKawabata, KNakai, HToda, M Discovery of long-acting N-(cyanomethyl)-N-alkyl-L-prolinamide inhibitors of dipeptidyl peptidase IV. Bioorg Med Chem 16:190-208 (2008)  
Target
Name:
Dipeptidyl peptidase 4
Synonyms:
ADABP Adenosine deaminase complexing protein 2 CD_antigen=CD26 DPP4 DPPIV Dipeptidyl peptidase 4 (DPP IV) Dipeptidyl peptidase 4 (DPP4) Dipeptidyl peptidase 4 membrane form Dipeptidyl peptidase IV Dipeptidyl peptidase IV (DDP-IV) Dipeptidyl peptidase IV membrane form Dipeptidyl peptidase-IV (DPP-4) T-cell activation antigen CD26 | TP103
Type:
Enzyme
Mol. Mass.:
88271.01
Organism:
Homo sapiens (Human)
Description:
P27487
Residue:
766
  
Inhibitor
Name:
BDBM50205206
Synonyms:
(2S,3S,5S)-5-((S)-2-cyanopyrrolidine-1-carbonyl)-N,N,2-trimethylpyrrolidine-3-carboxamide CHEMBL232914
Type:
Small organic molecule
Emp. Form.:
C14H22N4O2
Mol. Mass.:
278.3501
SMILES:
C[C@@H]1N[C@@H](C[C@@H]1C(=O)N(C)C)C(=O)N1CCC[C@H]1C#N
: