Target
C-X-C chemokine receptor type 3
Ligand
BDBM50375120
Substrate
Meas. Tech.
ChEMBL_470258 (CHEMBL950213)
IC50
8±n/a nM
Citation
 Hayes, MEBreinlinger, ECWallace, GAGrongsaard, PMiao, WMcPherson, MJStoffel, RHGreen, DWRoth, GP Lead identification of 2-iminobenzimidazole antagonists of the chemokine receptor CXCR3. Bioorg Med Chem Lett 18:2414-9 (2008)  
Target
Name:
C-X-C chemokine receptor type 3
Synonyms:
AAO92295.1 C-X-C chemokine receptor type 3 (CXCR3) CXCR3 CXCR3_HUMAN chemokine (C-X-C motif) receptor 3
Type:
Enzyme Catalytic Domain
Mol. Mass.:
40665.65
Organism:
Homo sapiens (Human)
Description:
Residue:
368
  
Inhibitor
Name:
BDBM50375120
Synonyms:
CHEMBL403040
Type:
Small organic molecule
Emp. Form.:
C31H27Cl2N5O2
Mol. Mass.:
572.484
SMILES:
Clc1ccc(cc1)C(=O)Cn1c2cccc(Cl)c2n(CC[C@@H]2CCCN2C(=O)c2cccc3cccnc23)c1=N
: