Target
Methionine aminopeptidase 1
Ligand
BDBM50375188
Substrate
Meas. Tech.
ChEMBL_470290 (CHEMBL951176)
Ki
>100000±n/a nM
Citation
 Haldar, MKScott, MDSule, NSrivastava, DKMallik, S Synthesis of barbiturate-based methionine aminopeptidase-1 inhibitors. Bioorg Med Chem Lett 18:2373-6 (2008)  
Target
Name:
Methionine aminopeptidase 1
Synonyms:
Aminopeptidase MAP 1 METAP1 Methionine Aminopeptidase Type 1 (MetAP1) | Peptidase M 1
Type:
Enzyme
Mol. Mass.:
43220.79
Organism:
Homo sapiens (Human)
Description:
MetAP1 with an N-terminal six histidine tag was expressed in baculovirus infected sf9 cells.
Residue:
386
  
Inhibitor
Name:
BDBM50375188
Synonyms:
CHEMBL408042
Type:
Small organic molecule
Emp. Form.:
C11H7N3O4S
Mol. Mass.:
277.256
SMILES:
[#8-]-[#7+](=O)-c1ccc(\[#6]=[#6]-2\[#6](=O)-[#7]-[#6](=S)-[#7]-[#6]-2=O)cc1
: