Target
Angiopoietin-1 receptor
Ligand
BDBM50236255
Substrate
Meas. Tech.
ChEMBL_470292 (CHEMBL950344)
IC50
1357±n/a nM
Citation
 Underiner, TLRuggeri, BAimone, LAlbom, MAngeles, TChang, HHudkins, RLHunter, KJosef, KRobinson, CWeinberg, LYang, SZulli, A TIE-2/VEGF-R2 SAR and in vitro activity of C3-acyl dihydroindazolo[5,4-a]pyrrolo[3,4-c]carbazole analogs. Bioorg Med Chem Lett 18:2368-72 (2008)  
Target
Name:
Angiopoietin-1 receptor
Synonyms:
TEK TIE2_HUMAN Tyrosine-protein kinase receptor (TIE-2) Tyrosine-protein kinase receptor TEK (p140 TEK) Tyrosine-protein kinase receptor TIE2/TEK VMCM1 p140 TEK
Type:
Enzyme
Mol. Mass.:
125835.70
Organism:
Homo sapiens (Human)
Description:
Q02763
Residue:
1124
  
Inhibitor
Name:
BDBM50236255
Synonyms:
19-methyl-3,13,19,20-tetraazahexacyclo[14.7.0.0^{2,10}.0^{4,9}.0^{11,15}.0^{17,21}]tricosa-1(16),2(10),4,6,8,11(15),17,20-octaen-14-one | CHEMBL258437
Type:
Small organic molecule
Emp. Form.:
C20H16N4O
Mol. Mass.:
328.3672
SMILES:
Cn1cc-2c(CCc3c-2c2C(=O)NCc2c2c4ccccc4[nH]c32)n1
: