Target
Vascular endothelial growth factor receptor 2
Ligand
BDBM50375192
Substrate
Meas. Tech.
ChEMBL_470295 (CHEMBL950347)
IC50
25±n/a nM
Citation
 Underiner, TLRuggeri, BAimone, LAlbom, MAngeles, TChang, HHudkins, RLHunter, KJosef, KRobinson, CWeinberg, LYang, SZulli, A TIE-2/VEGF-R2 SAR and in vitro activity of C3-acyl dihydroindazolo[5,4-a]pyrrolo[3,4-c]carbazole analogs. Bioorg Med Chem Lett 18:2368-72 (2008)  
Target
Name:
Vascular endothelial growth factor receptor 2
Synonyms:
CD_antigen=CD309 Fetal liver kinase 1 (FLK-1) KDR Protein-tyrosine kinase receptor Flk-1 VEGFR-2 VEGFR2 Vascular Endothelial Growth Factor Receptor Kinase 2 Vascular endothelial growth factor receptor 2 (KDR) Vascular endothelial growth factor receptor 2 (VEGFR2) Vascular endothelial growth factor receptor-2 (VEGFR-2)
Type:
Receptor Tyrosine Kinase
Mol. Mass.:
151510.97
Organism:
Homo sapiens (Human)
Description:
P35968
Residue:
1356
  
Inhibitor
Name:
BDBM50375192
Synonyms:
CHEMBL403158
Type:
Small organic molecule
Emp. Form.:
C29H25BrN4O2S
Mol. Mass.:
573.503
SMILES:
CC(C)Cn1c2ccc(cc2c2c3CNC(=O)c3c3-c4cn(C)nc4CCc3c12)C(=O)c1sccc1Br
: