Target
DNA polymerase beta
Ligand
BDBM50375300
Substrate
Meas. Tech.
ChEMBL_470719 (CHEMBL934559)
IC50
16300±n/a nM
Citation
 Naganuma, MNishida, MKuramochi, KSugawara, FYoshida, HMizushina, Y 1-deoxyrubralactone, a novel specific inhibitor of families X and Y of eukaryotic DNA polymerases from a fungal strain derived from sea algae. Bioorg Med Chem 16:2939-44 (2008)  
Target
Name:
DNA polymerase beta
Synonyms:
DNA Polymerase beta Polb
Type:
PROTEIN
Mol. Mass.:
38334.34
Organism:
Rattus norvegicus
Description:
ChEMBL_1361926
Residue:
335
  
Inhibitor
Name:
BDBM50375300
Synonyms:
TALAROFLAVONE
Type:
Small organic molecule
Emp. Form.:
C14H12O6
Mol. Mass.:
276.2415
SMILES:
COc1cc2c(C(=O)OC22C(C)CC(=O)C2=O)c(O)c1
: