Target
Lanosterol 14-alpha demethylase
Ligand
BDBM50128548
Substrate
Meas. Tech.
ChEMBL_470779 (CHEMBL934981)
IC50
342±n/a nM
Citation
 Ekins, SMankowski, DCHoover, DJLawton, MPTreadway, JLHarwood, HJ Three-dimensional quantitative structure-activity relationship analysis of human CYP51 inhibitors. Drug Metab Dispos 35:493-500 (2007)  
Target
Name:
Lanosterol 14-alpha demethylase
Synonyms:
CP51A_HUMAN CYP51A1 Cytochrome P450 51 LDM P450-14DM P450LI Sterol 14-alpha demethylase
Type:
Protein
Mol. Mass.:
56817.21
Organism:
Homo sapiens (Human)
Description:
Q16850
Residue:
503
  
Inhibitor
Name:
BDBM50128548
Synonyms:
1-(1-Biphenyl-4-yl-2-phenyl-methyl)-1H-imidazole 1-(Biphenyl-4-yl-phenyl-methyl)-1H-imidazole( Bifanozole) 1-(biphenyl-4-yl-phenyl-methyl)-1H-imidazole CHEMBL277535 cid_2378
Type:
Small organic molecule
Emp. Form.:
C22H18N2
Mol. Mass.:
310.3917
SMILES:
c1cn(cn1)C(c1ccccc1)c1ccc(cc1)-c1ccccc1
: