Target
Lanosterol 14-alpha demethylase
Ligand
BDBM50344965
Substrate
Meas. Tech.
ChEMBL_470779 (CHEMBL934981)
IC50
>200000±n/a nM
Citation
 Ekins, SMankowski, DCHoover, DJLawton, MPTreadway, JLHarwood, HJ Three-dimensional quantitative structure-activity relationship analysis of human CYP51 inhibitors. Drug Metab Dispos 35:493-500 (2007)  
Target
Name:
Lanosterol 14-alpha demethylase
Synonyms:
CP51A_HUMAN CYP51A1 Cytochrome P450 51 LDM P450-14DM P450LI Sterol 14-alpha demethylase
Type:
Protein
Mol. Mass.:
56817.21
Organism:
Homo sapiens (Human)
Description:
Q16850
Residue:
509
  
Inhibitor
Name:
BDBM50344965
Synonyms:
1-(4-chlorophenylsulfonyl)-3-propylurea 4-chloro-N-[(propylamino)carbonyl]benzenesulfonamide CHLORPROPAMIDE Glucamide
Type:
Small organic molecule
Emp. Form.:
C10H13ClN2O3S
Mol. Mass.:
276.74
SMILES:
CCCNC(=O)NS(=O)(=O)c1ccc(Cl)cc1
: