Target
Lanosterol 14-alpha demethylase
Ligand
BDBM50067133
Substrate
Meas. Tech.
ChEMBL_470779 (CHEMBL934981)
IC50
>200000±n/a nM
Citation
 Ekins, SMankowski, DCHoover, DJLawton, MPTreadway, JLHarwood, HJ Three-dimensional quantitative structure-activity relationship analysis of human CYP51 inhibitors. Drug Metab Dispos 35:493-500 (2007)  
Target
Name:
Lanosterol 14-alpha demethylase
Synonyms:
CP51A_HUMAN CYP51A1 Cytochrome P450 51 LDM P450-14DM P450LI Sterol 14-alpha demethylase
Type:
Protein
Mol. Mass.:
56817.21
Organism:
Homo sapiens (Human)
Description:
Q16850
Residue:
509
  
Inhibitor
Name:
BDBM50067133
Synonyms:
1-(2-(2-hydroxy-3-(propylamino)propoxy)phenyl)-3-phenylpropan-1-one 1-[2-(2-Hydroxy-3-propylamino-propoxy)-phenyl]-3-phenyl-propan-1-one (propafenone) CHEMBL631 PROPAFENONE | Rythmol
Type:
Small organic molecule
Emp. Form.:
C21H27NO3
Mol. Mass.:
341.444
SMILES:
CCCNCC(O)COc1ccccc1C(=O)CCc1ccccc1
: