Target
Lanosterol 14-alpha demethylase
Ligand
BDBM50375307
Substrate
Meas. Tech.
ChEMBL_470779 (CHEMBL934981)
IC50
>200000±n/a nM
Citation
 Ekins, SMankowski, DCHoover, DJLawton, MPTreadway, JLHarwood, HJ Three-dimensional quantitative structure-activity relationship analysis of human CYP51 inhibitors. Drug Metab Dispos 35:493-500 (2007)  
Target
Name:
Lanosterol 14-alpha demethylase
Synonyms:
CP51A_HUMAN CYP51A1 Cytochrome P450 51 LDM P450-14DM P450LI Sterol 14-alpha demethylase
Type:
Protein
Mol. Mass.:
56817.21
Organism:
Homo sapiens (Human)
Description:
Q16850
Residue:
503
  
Inhibitor
Name:
BDBM50375307
Synonyms:
CHEMBL409811
Type:
Small organic molecule
Emp. Form.:
C19H23N3O3
Mol. Mass.:
341.4042
SMILES:
OC1CCN(CC1)C(=O)C(Cc1ccccc1)NC(=O)c1ccc[nH]1
: