Target
Potassium voltage-gated channel subfamily H member 2
Ligand
BDBM50375351
Substrate
Meas. Tech.
ChEMBL_471260 (CHEMBL922329)
IC50
0.65±n/a nM
Citation
 Schläger, TSchepmann, DWürthwein, EUWünsch, B Synthesis and structure-affinity relationships of novel spirocyclic sigma receptor ligands with furopyrazole structure. Bioorg Med Chem 16:2992-3001 (2008)  
Target
Name:
Potassium voltage-gated channel subfamily H member 2
Synonyms:
1,3-beta-glucan synthase component GLS2 ERG Eag-related protein 1 Ether-a-go-go-related gene (HERG) Ether-a-go-go-related gene potassium channel 1 Ether-a-go-go-related gene potassium channel 1 (hERG1) Ether-a-go-go-related protein 1 H-ERG KCNH2 Potassium voltage-gated channel subfamily H member 2 (hERG) Voltage-gated potassium channel subunit Kv11.1 hERG Potassium Channel 1 | putative potassium channel subunit
Type:
Multi-pass membrane protein
Mol. Mass.:
126672.65
Organism:
Homo sapiens (Human)
Description:
Q12809
Residue:
1159
  
Inhibitor
Name:
BDBM50375351
Synonyms:
CHEMBL259732
Type:
Small organic molecule
Emp. Form.:
C20H27N3O2
Mol. Mass.:
341.4473
SMILES:
CCCCN1CCC2(CC1)OC(OC)c1c2cnn1-c1ccccc1
: