Target
Cannabinoid receptor 2
Ligand
BDBM50375382
Substrate
Meas. Tech.
ChEMBL_471727 (CHEMBL920999)
IC50
1.4±n/a nM
Citation
 Ohta, HIshizaka, TTatsuzuki, MYoshinaga, MIida, IYamaguchi, TTomishima, YFutaki, NToda, YSaito, S Imine derivatives as new potent and selective CB2 cannabinoid receptor agonists with an analgesic action. Bioorg Med Chem 16:1111-24 (2008)  
Target
Name:
Cannabinoid receptor 2
Synonyms:
CANNABINOID CB2 CB2 Cannabinoid CB2 receptor Cnr2 | rCB2
Type:
Enzyme
Mol. Mass.:
39366.68
Organism:
Rattus norvegicus (Rat)
Description:
Q9QZN9
Residue:
360
  
Inhibitor
Name:
BDBM50375382
Synonyms:
CHEMBL410014
Type:
Small organic molecule
Emp. Form.:
C20H23F4N3O
Mol. Mass.:
397.4097
SMILES:
Cn1c(c\c(=N/C(=O)c2cccc(c2F)C(F)(F)F)n1CC1CC1)C(C)(C)C
: