Target
Progesterone receptor
Ligand
BDBM50375441
Substrate
Meas. Tech.
ChEMBL_472013 (CHEMBL940096)
EC50
0.15±n/a nM
Citation
 Rewinkel, JEnthoven, MGolstein, Ivan der Rijst, MScholten, Avan Tilborg, Mde Weys, DWisse, JHamersma, H 11-(pyridinylphenyl)steroids--a new class of mixed-profile progesterone agonists/antagonists. Bioorg Med Chem 16:2753-63 (2008)  
Target
Name:
Progesterone receptor
Synonyms:
NR3C3 PGR PRGR_HUMAN | progesterone
Type:
Protein
Mol. Mass.:
98979.52
Organism:
Homo sapiens (Human)
Description:
P06401
Residue:
933
  
Inhibitor
Name:
BDBM50375441
Synonyms:
CHEMBL260330
Type:
Small organic molecule
Emp. Form.:
C34H37NO3
Mol. Mass.:
507.6625
SMILES:
COc1ccc(cn1)-c1ccc(cc1)[C@H]1C[C@@]2(C)[C@@H](CCC22CCCC2=O)[C@@H]2CCC3=CC(=O)CCC3=C12
: