Target
Sucrase-isomaltase, intestinal
Ligand
BDBM50234562
Substrate
Meas. Tech.
ChEMBL_472705 (CHEMBL923889)
IC50
70000±n/a nM
Citation
 Minami, YKuriyama, CIkeda, KKato, ATakebayashi, KAdachi, IFleet, GWKettawan, AOkamoto, TAsano, N Effect of five-membered sugar mimics on mammalian glycogen-degrading enzymes and various glucosidases. Bioorg Med Chem 16:2734-40 (2008)  
Target
Name:
Sucrase-isomaltase, intestinal
Synonyms:
SUIS_RAT Sucrase-isomaltase | alpha-Glucosidase (α-Glucosidase)
Type:
Enzyme
Mol. Mass.:
210329.04
Organism:
Rattus norvegicus (Rat)
Description:
P23739
Residue:
1841
  
Inhibitor
Name:
BDBM50234562
Synonyms:
1,4-Dideoxy-1,4-imino-(hydroxyethyliminiumyl)-D-arabinitol CHEMBL247666
Type:
Small organic molecule
Emp. Form.:
C7H15NO4
Mol. Mass.:
177.1983
SMILES:
OCCN1C[C@@H](O)[C@H](O)[C@H]1CO
: