Target
G-protein coupled bile acid receptor 1
Ligand
BDBM17639
Substrate
Meas. Tech.
ChEMBL_472949 (CHEMBL949256)
EC50
6220±n/a nM
Citation
 Sato, HMacchiarulo, AThomas, CGioiello, AUne, MHofmann, AFSaladin, RSchoonjans, KPellicciari, RAuwerx, J Novel potent and selective bile acid derivatives as TGR5 agonists: biological screening, structure-activity relationships, and molecular modeling studies. J Med Chem 51:1831-41 (2008)  
Target
Name:
G-protein coupled bile acid receptor 1
Synonyms:
BG37 GPBAR_HUMAN TGR5 hGPCR19
Type:
G Protein-Coupled Receptor (GPCR)
Mol. Mass.:
35260.02
Organism:
Homo sapiens (Human)
Description:
CHO cells transiently transfected with hTGR5.
Residue:
330
  
Inhibitor
Name:
BDBM17639
Synonyms:
(1S,2S,5R,7S,10R,11S,15S)-5-hydroxy-2,15-dimethyltetracyclo[8.7.0.0^{2,7}.0^{11,15}]heptadecan-14-one CHEMBL87285
Type:
Steroid
Emp. Form.:
C19H30O2
Mol. Mass.:
290.4403
SMILES:
[H][C@@]12CCC(=O)[C@@]1(C)CC[C@@]1([H])[C@@]2([H])CC[C@@]2([H])C[C@H](O)CC[C@]12C
: