Target
Glycogen synthase kinase-3 beta
Ligand
BDBM50113707
Substrate
Meas. Tech.
ChEMBL_473809 (CHEMBL937073)
Kd
126±n/a nM
Citation
 Fedorov, OMarsden, BPogacic, VRellos, PMüller, SBullock, ANSchwaller, JSundström, MKnapp, S A systematic interaction map of validated kinase inhibitors with Ser/Thr kinases. Proc Natl Acad Sci U S A 104:20523-8 (2007)  
Target
Name:
Glycogen synthase kinase-3 beta
Synonyms:
GSK-3 beta GSK3B Glycogen synthase kinase 3 beta (GSK3B) Glycogen synthase kinase-3 beta (GSK-3B) Glycogen synthase kinase-3 beta (GSK3B) Glycogen synthase kinase-3beta (GSK3B) | Serine/threonine-protein kinase GSK3B
Type:
Enzyme
Mol. Mass.:
46756.38
Organism:
Homo sapiens (Human)
Description:
P49841
Residue:
420
  
Inhibitor
Name:
BDBM50113707
Synonyms:
2,6,9-Trisubstitute purine, 2 2-[6-(3-Chloro-phenylamino)-9-isopropyl-9H-purin-2-ylamino]-ethanol | CHEMBL311228
Type:
Small organic molecule
Emp. Form.:
C16H19ClN6O
Mol. Mass.:
346.815
SMILES:
CC(C)n1cnc2c(Nc3cccc(Cl)c3)nc(NCCO)nc12
: