Target
Tyrosine-protein kinase SYK
Ligand
BDBM50200392
Substrate
Meas. Tech.
ChEMBL_473778 (CHEMBL939212)
IC50
887±n/a nM
Citation
 Fedorov, OMarsden, BPogacic, VRellos, PMüller, SBullock, ANSchwaller, JSundström, MKnapp, S A systematic interaction map of validated kinase inhibitors with Ser/Thr kinases. Proc Natl Acad Sci U S A 104:20523-8 (2007)  
Target
Name:
Tyrosine-protein kinase SYK
Synonyms:
KSYK_HUMAN Spleen Tyrosine Kinase Tyrosine-protein kinase SYK (Syk)
Type:
Enzyme
Mol. Mass.:
72079.99
Organism:
Homo sapiens (Human)
Description:
P43405
Residue:
635
  
Inhibitor
Name:
BDBM50200392
Synonyms:
CHEMBL383899 N-3-4-3-trifluoromethyl)phenylamino)pyrimidin-2-ylamino)phenyl)cyclopropanecarboxamide | N-{3-[(4-{[3-(TRIFLUOROMETHYL)PHENYL]AMINO}PYRIMIDIN-2-YL)AMINO]PHENYL}CYCLOPROPANECARBOXAMIDE
Type:
Small organic molecule
Emp. Form.:
C21H18F3N5O
Mol. Mass.:
413.3957
SMILES:
FC(F)(F)c1cccc(Nc2ccnc(Nc3cccc(NC(=O)C4CC4)c3)n2)c1
: