Target
C-C chemokine receptor type 2
Ligand
BDBM50375755
Substrate
Meas. Tech.
ChEMBL_473976 (CHEMBL933957)
IC50
53±n/a nM
Citation
 Moree, WJKataoka, KRamirez-Weinhouse, MMShiota, TImai, MTsutsumi, TSudo, MEndo, NMuroga, YHada, TFanning, DSaunders, JKato, YMyers, PLTarby, CM Potent antagonists of the CCR2b receptor. Part 3: SAR of the (R)-3-aminopyrrolidine series. Bioorg Med Chem Lett 18:1869-73 (2008)  
Target
Name:
C-C chemokine receptor type 2
Synonyms:
C-C chemokine receptor type 2 (CCR2) CCR2_HUMAN Chemoattractant Cytokine Receptor 2 (CCR2) Monocyte chemotactic protein-1 (MCP-1)
Type:
Enzyme
Mol. Mass.:
41932.32
Organism:
Homo sapiens (Human)
Description:
P41597
Residue:
374
  
Inhibitor
Name:
BDBM50375755
Synonyms:
CHEMBL404269
Type:
Small organic molecule
Emp. Form.:
C22H25F3N4O4
Mol. Mass.:
466.4535
SMILES:
COc1ccc(CN2CC[C@H](C2)NC(=O)CNC(=O)c2cc(ccc2N)C(F)(F)F)cc1O
: