Target
ATP-dependent translocase ABCB1
Ligand
BDBM50411951
Substrate
Meas. Tech.
ChEMBL_474393 (CHEMBL939120)
IC50
776.25±n/a nM
Citation
 Müller, HPajeva, IKGlobisch, CWiese, M Functional assay and structure-activity relationships of new third-generation P-glycoprotein inhibitors. Bioorg Med Chem 16:2448-62 (2008)  
Target
Name:
ATP-dependent translocase ABCB1
Synonyms:
ABCB1 MDR1_HUMAN Multidrug resistance protein 1 P-glycoprotein (P-gp) PGY1
Type:
Protein
Mol. Mass.:
141503.50
Organism:
Homo sapiens (Human)
Description:
P08183
Residue:
1280
  
Inhibitor
Name:
BDBM50411951
Synonyms:
CHEMBL260113
Type:
Small organic molecule
Emp. Form.:
C30H30N2O3
Mol. Mass.:
466.5708
SMILES:
COc1cc2CCN(CCc3ccc(NC(=O)c4ccc5ccccc5c4)cc3)Cc2cc1OC
: