Target
Gonadotropin-releasing hormone receptor
Ligand
BDBM50122657
Substrate
Meas. Tech.
ChEMBL_474609 (CHEMBL921115)
Ki
0.8±n/a nM
Citation
 Feher, MGao, YBaber, JCShirley, WASaunders, J The use of ligand-based de novo design for scaffold hopping and sidechain optimization: two case studies. Bioorg Med Chem 16:422-7 (2008)  
Target
Name:
Gonadotropin-releasing hormone receptor
Synonyms:
GNRHR GRHR GnRH-R Gonadotropin-releasing hormone receptor | Gonadotropin-releasing hormone receptor (GnRH)
Type:
Enzyme
Mol. Mass.:
37749.45
Organism:
Homo sapiens (Human)
Description:
P30968
Residue:
328
  
Inhibitor
Name:
BDBM50122657
Synonyms:
CHEMBL21126 N-{4-[5-[(Benzyl-methyl-amino)-methyl]-1-(2,6-difluoro-benzyl)-2,4-dioxo-3-phenyl-1,2,3,4-tetrahydro-thieno[2,3-d]pyrimidin-6-yl]-phenyl}-propionamide; HCL.H2O | N-{4-[5-[(benzyl-methyl-amino)-methyl]-1-(2,6-difluoro-benzyl)-2,4-dioxo-3-phenyl-1,2,3,4-tetrahydro-thieo[2,3-d]pyrimidin-6-yl]-phenyl}-propionamide
Type:
Small organic molecule
Emp. Form.:
C37H32F2N4O3S
Mol. Mass.:
650.737
SMILES:
CCC(=O)Nc1ccc(cc1)-c1sc2n(Cc3c(F)cccc3F)c(=O)n(-c3ccccc3)c(=O)c2c1CN(C)Cc1ccccc1
: