Target
5-hydroxytryptamine receptor 7
Ligand
BDBM50375988
Substrate
Meas. Tech.
ChEMBL_474639 (CHEMBL921838)
IC50
95±n/a nM
Citation
 Na, YHHong, SHLee, JHPark, WKBaek, DJKoh, HYCho, YSChoo, HPae, AN Novel quinazolinone derivatives as 5-HT7 receptor ligands. Bioorg Med Chem 16:2570-8 (2008)  
Target
Name:
5-hydroxytryptamine receptor 7
Synonyms:
5-HT-7 5-HT7 5-HT7S 5HT7 HTR7 | Serotonin receptor 7
Type:
G Protein-Coupled Receptor (GPCR)
Mol. Mass.:
53573.08
Organism:
Homo sapiens (Human)
Description:
P34969
Residue:
479
  
Inhibitor
Name:
BDBM50375988
Synonyms:
CHEMBL261291
Type:
Small organic molecule
Emp. Form.:
C30H33N5O2
Mol. Mass.:
495.6153
SMILES:
Cc1cccc(N2CCN(CCC(=O)NCc3nc4ccccc4c(=O)n3-c3ccccc3)CC2)c1C
: