Target
Glycogen synthase kinase-3 beta
Ligand
BDBM50376067
Substrate
Meas. Tech.
ChEMBL_475116 (CHEMBL932638)
IC50
1400±n/a nM
Citation
 Caldwell, JJDavies, TGDonald, AMcHardy, TRowlands, MGAherne, GWHunter, LKTaylor, KRuddle, RRaynaud, FIVerdonk, MWorkman, PGarrett, MDCollins, I Identification of 4-(4-aminopiperidin-1-yl)-7H-pyrrolo[2,3-d]pyrimidines as selective inhibitors of protein kinase B through fragment elaboration. J Med Chem 51:2147-57 (2008)  
Target
Name:
Glycogen synthase kinase-3 beta
Synonyms:
GSK-3 beta GSK3B Glycogen synthase kinase 3 beta (GSK3B) Glycogen synthase kinase-3 beta (GSK-3B) Glycogen synthase kinase-3 beta (GSK3B) Glycogen synthase kinase-3beta (GSK3B) | Serine/threonine-protein kinase GSK3B
Type:
Enzyme
Mol. Mass.:
46756.38
Organism:
Homo sapiens (Human)
Description:
P49841
Residue:
420
  
Inhibitor
Name:
BDBM50376067
Synonyms:
CHEMBL260000
Type:
Small organic molecule
Emp. Form.:
C19H22ClN5
Mol. Mass.:
355.864
SMILES:
NCC1(Cc2ccc(Cl)cc2)CCN(CC1)c1ncnc2[nH]ccc12
: