Target
Carbonic anhydrase 2
Ligand
BDBM25904
Substrate
Meas. Tech.
ChEMBL_475785 (CHEMBL935610)
Ki
7.2±n/a nM
Citation
 Di Fiore, APedone, CAntel, JWaldeck, HWitte, AWurl, MScozzafava, ASupuran, CTDe Simone, G Carbonic anhydrase inhibitors: the X-ray crystal structure of ethoxzolamide complexed to human isoform II reveals the importance of thr200 and gln92 for obtaining tight-binding inhibitors. Bioorg Med Chem Lett 18:2669-74 (2008)  
Target
Name:
Carbonic anhydrase 2
Synonyms:
CA-II CAC Carbonate dehydratase II Carbonic anhydrase 2 (CA-II) Carbonic anhydrase C Carbonic anhydrase II (CA-II) Carbonic anhydrase II (hCA II) | Carbonic anhydrase isoenzyme II (hCA II)
Type:
Enzyme
Mol. Mass.:
29250.71
Organism:
Homo sapiens (Human)
Description:
P00918
Residue:
260
  
Inhibitor
Name:
BDBM25904
Synonyms:
2-(hydrazinecarbonyl)-3-phenyl-1H-indole-5-sulfonamide CHEMBL262628 | indole sulfonamide, L
Type:
Small organic molecule
Emp. Form.:
C15H14N4O3S
Mol. Mass.:
330.362
SMILES:
NNC(=O)c1[nH]c2ccc(cc2c1-c1ccccc1)S(N)(=O)=O
: