Target
5-hydroxytryptamine receptor 7
Ligand
BDBM50354525
Substrate
Meas. Tech.
ChEMBL_476009 (CHEMBL927089)
Ki
44±n/a nM
Citation
 Volk, BBarkóczy, JHegedus, EUdvari, SGacsályi, IMezei, TPallagi, KKompagne, HLévay, GEgyed, AHársing, LGSpedding, MSimig, G (Phenylpiperazinyl-butyl)oxindoles as selective 5-HT7 receptor antagonists. J Med Chem 51:2522-32 (2008)  
Target
Name:
5-hydroxytryptamine receptor 7
Synonyms:
5-HT-7 5-HT7 5-HT7S 5HT7 HTR7 | Serotonin receptor 7
Type:
G Protein-Coupled Receptor (GPCR)
Mol. Mass.:
53573.08
Organism:
Homo sapiens (Human)
Description:
P34969
Residue:
479
  
Inhibitor
Name:
BDBM50354525
Synonyms:
CHEMBL411663
Type:
Small organic molecule
Emp. Form.:
C22H26FN3O
Mol. Mass.:
367.4597
SMILES:
Fc1ccc2NC(=O)C(CCCCN3CCN(CC3)c3ccccc3)c2c1
: