Target
RAC-alpha serine/threonine-protein kinase
Ligand
BDBM50376349
Substrate
Meas. Tech.
ChEMBL_476040 (CHEMBL928166)
IC50
>100000±n/a nM
Citation
 Gracias, VJi, ZAkritopoulou-Zanze, IAbad-Zapatero, CHuth, JRSong, DHajduk, PJJohnson, EFGlaser, KBMarcotte, PAPease, LSoni, NBStewart, KDDavidsen, SKMichaelides, MRDjuric, SW Scaffold oriented synthesis. Part 2: Design, synthesis and biological evaluation of pyrimido-diazepines as receptor tyrosine kinase inhibitors. Bioorg Med Chem Lett 18:2691-5 (2008)  
Target
Name:
RAC-alpha serine/threonine-protein kinase
Synonyms:
AKT phosphorylation (p-AKT) AKT1/PPP1CA C-AKT PKB alpha Protein kinase B Protein kinase B (Akt 1) Protein kinase B alpha Proto-oncogene Akt (Akt1) Proto-oncogene c-Akt (AKT1) RAC-PK-alpha RAC-alpha serine/threonine-protein kinase (AKT1) | RAC-alpha serine/threonine-protein kinase (pAKT)
Type:
Enzyme
Mol. Mass.:
55681.25
Organism:
Homo sapiens (Human)
Description:
P31749
Residue:
480
  
Inhibitor
Name:
BDBM50376349
Synonyms:
CHEMBL405233
Type:
Small organic molecule
Emp. Form.:
C14H15N5
Mol. Mass.:
253.3024
SMILES:
Cc1ccc(cc1)C1=Nc2c(N)ncnc2NCC1
: