Target
Vascular endothelial growth factor receptor 2
Ligand
BDBM50376359
Substrate
Meas. Tech.
ChEMBL_476041 (CHEMBL928167)
IC50
3±n/a nM
Citation
 Gracias, VJi, ZAkritopoulou-Zanze, IAbad-Zapatero, CHuth, JRSong, DHajduk, PJJohnson, EFGlaser, KBMarcotte, PAPease, LSoni, NBStewart, KDDavidsen, SKMichaelides, MRDjuric, SW Scaffold oriented synthesis. Part 2: Design, synthesis and biological evaluation of pyrimido-diazepines as receptor tyrosine kinase inhibitors. Bioorg Med Chem Lett 18:2691-5 (2008)  
Target
Name:
Vascular endothelial growth factor receptor 2
Synonyms:
CD_antigen=CD309 Fetal liver kinase 1 (FLK-1) KDR Protein-tyrosine kinase receptor Flk-1 VEGFR-2 VEGFR2 Vascular Endothelial Growth Factor Receptor Kinase 2 Vascular endothelial growth factor receptor 2 (KDR) Vascular endothelial growth factor receptor 2 (VEGFR2) Vascular endothelial growth factor receptor-2 (VEGFR-2)
Type:
Receptor Tyrosine Kinase
Mol. Mass.:
151510.97
Organism:
Homo sapiens (Human)
Description:
P35968
Residue:
1356
  
Inhibitor
Name:
BDBM50376359
Synonyms:
CHEMBL260092
Type:
Small organic molecule
Emp. Form.:
C21H18F3N7O
Mol. Mass.:
441.4091
SMILES:
Nc1ncnc2NCCC(=Nc12)c1ccc(NC(=O)Nc2cccc(c2)C(F)(F)F)cc1
: