Target
Carbonic anhydrase 2
Ligand
BDBM50376370
Substrate
Meas. Tech.
ChEMBL_476226 (CHEMBL935812)
pH
7±n/a
Kd
800±n/a nM
Comments
extracted
Citation
 Maryanoff, BEMcComsey, DFLee, JSmith-Swintosky, VLWang, YMinor, LKTodd, MJ Carbonic anhydrase-II inhibition. what are the true enzyme-inhibitory properties of the sulfamide cognate of topiramate? J Med Chem 51:2518-21 (2008)  
Target
Name:
Carbonic anhydrase 2
Synonyms:
CA-II CAC Carbonate dehydratase II Carbonic anhydrase 2 (CA-II) Carbonic anhydrase C Carbonic anhydrase II (CA-II) Carbonic anhydrase II (hCA II) | Carbonic anhydrase isoenzyme II (hCA II)
Type:
Enzyme
Mol. Mass.:
29250.71
Organism:
Homo sapiens (Human)
Description:
P00918
Residue:
260
  
Inhibitor
Name:
BDBM50376370
Synonyms:
CHEMBL410329
Type:
Small organic molecule
Emp. Form.:
C15H25NO8S
Mol. Mass.:
379.426
SMILES:
CC1(C)O[C@H]2[C@@H]3OC4(CCCCC4)O[C@@H]3CO[C@@]2(COS(N)(=O)=O)O1
: