Target
Metabotropic glutamate receptor 2
Ligand
BDBM50376406
Substrate
Meas. Tech.
ChEMBL_476271 (CHEMBL929194)
IC50
4.45±n/a nM
Citation
 Sakagami, KYasuhara, AChaki, SYoshikawa, RKawakita, YSaito, ATaguchi, TNakazato, A Synthesis, in vitro pharmacology, and pharmacokinetic profiles of 2-[1-amino-1-carboxy-2-(9H-xanthen-9-yl)-ethyl]-1-fluorocyclopropanecarboxylic acid and its 6-heptyl ester, a potent mGluR2 antagonist. Bioorg Med Chem 16:4359-66 (2008)  
Target
Name:
Metabotropic glutamate receptor 2
Synonyms:
GPRC1B GRM2_HUMAN Metabotropic glutamate receptor mGlu2 | metabotropic glutamate 2
Type:
Enzyme
Mol. Mass.:
95584.88
Organism:
Homo sapiens (Human)
Description:
Q14416
Residue:
872
  
Inhibitor
Name:
BDBM50376406
Synonyms:
CHEMBL259435
Type:
Small organic molecule
Emp. Form.:
C20H18FNO5
Mol. Mass.:
371.359
SMILES:
NC(CC1c2ccccc2Oc2ccccc12)(C1CC1(F)C(O)=O)C(O)=O
: