Target
Coagulation factor VIII
Ligand
BDBM50423622
Substrate
Meas. Tech.
ChEMBL_476659 (CHEMBL927172)
IC50
7800±n/a nM
Citation
 Segers, KSperandio, OSack, MFischer, RMiteva, MARosing, JNicolaes, GAVilloutreix, BO Design of protein membrane interaction inhibitors by virtual ligand screening, proof of concept with the C2 domain of factor V. Proc Natl Acad Sci U S A 104:12697-702 (2007)  
Target
Name:
Coagulation factor VIII
Synonyms:
AHF F8 FA8_HUMAN Factor VIII B chain Factor VIIIa heavy chain, 92 kDa isoform Procoagulant component
Type:
Protein
Mol. Mass.:
267036.98
Organism:
Homo sapiens (Human)
Description:
P00451
Residue:
2351
  
Inhibitor
Name:
BDBM50423622
Synonyms:
CHEMBL1614804
Type:
Small organic molecule
Emp. Form.:
C23H28Cl2N4O2
Mol. Mass.:
463.4
SMILES:
O[C@@H](COc1ccc(Cl)cc1Cl)Cn1c2ccccc2n(CCN2CCCCC2)c1=N
: