Target
Metabotropic glutamate receptor 2
Ligand
BDBM50332991
Substrate
Meas. Tech.
ChEMBL_476980 (CHEMBL937485)
IC50
16±n/a nM
Citation
 Woltering, TJWichmann, JGoetschi, EAdam, GKew, JNKnoflach, FBallard, TMHuwyler, JMutel, VGatti, S Synthesis and characterization of 1,3-dihydro-benzo[b][1,4]diazepin-2-one derivatives: Part 3. New potent non-competitive metabotropic glutamate receptor 2/3 antagonists. Bioorg Med Chem Lett 18:2725-9 (2008)  
Target
Name:
Metabotropic glutamate receptor 2
Synonyms:
GPRC1B GRM2_HUMAN Metabotropic glutamate receptor mGlu2 | metabotropic glutamate 2
Type:
Enzyme
Mol. Mass.:
95584.88
Organism:
Homo sapiens (Human)
Description:
Q14416
Residue:
872
  
Inhibitor
Name:
BDBM50332991
Synonyms:
4-(3-(1H-1,2,3-triazol-1-yl)phenyl)-8-(2-fluorophenyl)-1H-benzo[b][1,4]diazepin-2(3H)-one | CHEMBL261288
Type:
Small organic molecule
Emp. Form.:
C23H16FN5O
Mol. Mass.:
397.4044
SMILES:
Fc1ccccc1-c1ccc2N=C(CC(=O)Nc2c1)c1cccc(c1)-n1ccnn1
: