Target
Cannabinoid receptor 2
Ligand
BDBM50376555
Substrate
Meas. Tech.
ChEMBL_477389 (CHEMBL928177)
EC50
6.3±n/a nM
Citation
 Verbist, BMDe Cleyn, MASurkyn, MFraiponts, EAerssens, JNijsen, MJGijsen, HJ 5-Sulfonyl-benzimidazoles as selective CB2 agonists. Bioorg Med Chem Lett 18:2574-9 (2008)  
Target
Name:
Cannabinoid receptor 2
Synonyms:
CANNABINOID CB2 CB2 CB2B CNR2_HUMAN Cannabinoid CB2 receptor Cannabinoid receptor 2 (CB2R) | hCB2
Type:
G Protein-Coupled Receptor (GPCR)
Mol. Mass.:
39690.94
Organism:
Homo sapiens (Human)
Description:
P34972
Residue:
360
  
Inhibitor
Name:
BDBM50376555
Synonyms:
CHEMBL256992
Type:
Small organic molecule
Emp. Form.:
C25H31ClN2O2S
Mol. Mass.:
459.044
SMILES:
CCOc1ccc(Cc2nc3cc(c(Cl)cc3n2CC2CCCCC2)S(=O)CC)cc1
: