Target
Cholesteryl ester transfer protein
Ligand
BDBM50376702
Substrate
Meas. Tech.
ChEMBL_477677 (CHEMBL924743)
IC50
3300±n/a nM
Citation
 Harikrishnan, LSKamau, MGHerpin, TFMorton, GCLiu, YCooper, CBSalvati, MEQiao, JXWang, TCAdam, LPTaylor, DSChen, AYYin, XSeethala, RPeterson, TLNirschl, DSMiller, AVWeigelt, CAAppiah, KKO'Connell, JCMichael Lawrence, R 2-Arylbenzoxazoles as novel cholesteryl ester transfer protein inhibitors: optimization via array synthesis. Bioorg Med Chem Lett 18:2640-4 (2008)  
Target
Name:
Cholesteryl ester transfer protein
Synonyms:
CETP Cholesteryl ester transfer protein (CETP) | Lipid transfer protein I
Type:
Enzyme
Mol. Mass.:
54751.53
Organism:
Homo sapiens (Human)
Description:
P11597
Residue:
493
  
Inhibitor
Name:
BDBM50376702
Synonyms:
CHEMBL261356
Type:
Small organic molecule
Emp. Form.:
C29H24N2O3
Mol. Mass.:
448.5125
SMILES:
Cc1cc(C)c2oc(nc2c1)-c1ccc(NC(=O)COc2ccccc2-c2ccccc2)cc1
: