Target
Cholesteryl ester transfer protein
Ligand
BDBM50376704
Substrate
Meas. Tech.
ChEMBL_477678 (CHEMBL924744)
IC50
32000±n/a nM
Citation
 Harikrishnan, LSKamau, MGHerpin, TFMorton, GCLiu, YCooper, CBSalvati, MEQiao, JXWang, TCAdam, LPTaylor, DSChen, AYYin, XSeethala, RPeterson, TLNirschl, DSMiller, AVWeigelt, CAAppiah, KKO'Connell, JCMichael Lawrence, R 2-Arylbenzoxazoles as novel cholesteryl ester transfer protein inhibitors: optimization via array synthesis. Bioorg Med Chem Lett 18:2640-4 (2008)  
Target
Name:
Cholesteryl ester transfer protein
Synonyms:
CETP Cholesteryl ester transfer protein (CETP) | Lipid transfer protein I
Type:
Enzyme
Mol. Mass.:
54751.53
Organism:
Homo sapiens (Human)
Description:
P11597
Residue:
493
  
Inhibitor
Name:
BDBM50376704
Synonyms:
CHEMBL259598
Type:
Small organic molecule
Emp. Form.:
C24H19F3N2O3
Mol. Mass.:
440.4145
SMILES:
Cc1cc(C)c2oc(nc2c1)-c1ccc(NC(=O)COc2cccc(c2)C(F)(F)F)cc1
: