Target
Solute carrier family 22 member 12
Ligand
BDBM50026604
Substrate
Meas. Tech.
ChEMBL_477689 (CHEMBL925845)
IC50
100000±n/a nM
Citation
 Yu, ZFong, WPCheng, CH Morin (3,5,7,2',4'-pentahydroxyflavone) exhibits potent inhibitory actions on urate transport by the human urate anion transporter (hURAT1) expressed in human embryonic kidney cells. Drug Metab Dispos 35:981-6 (2007)  
Target
Name:
Solute carrier family 22 member 12
Synonyms:
OATL4 RST S22AC_HUMAN Solute carrier family 22 member 12 URAT1 Urate anion exchanger 1 (URAT1) | Uric Acid Transporter 1 (URAT1)
Type:
Enzyme
Mol. Mass.:
59638.65
Organism:
Homo sapiens (Human)
Description:
Q96S37
Residue:
553
  
Inhibitor
Name:
BDBM50026604
Synonyms:
1,2-Diphenyl-3,5-dioxo-4-(2-phenylsulfinylethyl)pyrazolidine 1,2-diphenyl-4-[2-(phenylsulfinyl)ethyl]pyrazolidine-3,5-dione Anturane (TN) SULFINPYRAZONE | Sulfoxyphenylpyrazolidine
Type:
Small organic molecule
Emp. Form.:
C23H20N2O3S
Mol. Mass.:
404.482
SMILES:
Oc1c(CCS(=O)c2ccccc2)c(=O)n(-c2ccccc2)n1-c1ccccc1
: