Target
Growth hormone secretagogue receptor type 1
Ligand
BDBM50376760
Substrate
Meas. Tech.
ChEMBL_477813 (CHEMBL931245)
EC50
0.2±n/a nM
Citation
 Li, JJWang, HLi, JQu, FSwartz, SGHernández, ASBiller, SARobl, JATino, JASlusarchyk, DSeethala, RSleph, PYan, MGrover, GFlynn, NMurphy, BJGordon, D Tetrazole based amides as growth hormone secretagogues. Bioorg Med Chem Lett 18:2536-9 (2008)  
Target
Name:
Growth hormone secretagogue receptor type 1
Synonyms:
GH-releasing peptide receptor GHS-R GHSR_HUMAN Ghrelin receptor | Ghrelin receptor 1a (GHS-R1a)
Type:
Receptor
Mol. Mass.:
41334.57
Organism:
Homo sapiens (Human)
Description:
Receptor binding studies use plasma membranes from LLC PK-1 cells transiently transfected with hGHSR1a.
Residue:
366
  
Inhibitor
Name:
BDBM50376760
Synonyms:
CHEMBL410074
Type:
Small organic molecule
Emp. Form.:
C22H35N7O6S
Mol. Mass.:
525.622
SMILES:
CC(C)(N)C(=O)N[C@H](COCc1ccccc1)c1nnnn1CCCC(=O)NCCS(=O)(=O)CCO
: