Target
Hydroxycarboxylic acid receptor 2
Ligand
BDBM50216550
Substrate
Meas. Tech.
ChEMBL_479051 (CHEMBL921658)
IC50
4200±n/a nM
Citation
 Richman, JGKanemitsu-Parks, MGaidarov, ICameron, JSGriffin, PZheng, HGuerra, NCCham, LMaciejewski-Lenoir, DBehan, DPBoatman, DChen, RSkinner, POrnelas, PWaters, MGWright, SDSemple, GConnolly, DT Nicotinic acid receptor agonists differentially activate downstream effectors. J Biol Chem 282:18028-36 (2007)  
Target
Name:
Hydroxycarboxylic acid receptor 2
Synonyms:
G-protein coupled receptor 109A GPR109A HCAR2 HM74A NIACR1 Nicotinic acid receptor 1
Type:
G Protein-Coupled Receptor (GPCR)
Mol. Mass.:
41868.22
Organism:
Homo sapiens (Human)
Description:
Membranes from CHO cells expressing the recombinant human GPR109A were used in competition binding assay.
Residue:
363
  
Inhibitor
Name:
BDBM50216550
Synonyms:
3-(3-chlorobenzyl)-1H-pyrazole-5-carboxylic acid 5-meta-chlorobenzyl-3-carboxyl-pyrazole | CHEMBL394441
Type:
Small organic molecule
Emp. Form.:
C11H9ClN2O2
Mol. Mass.:
236.654
SMILES:
OC(=O)c1cc(Cc2cccc(Cl)c2)[nH]n1
: